PRESENTED BY Adobe Express
how to beat a delivery charge
get file path from content uri android 10

Npm err exit status 1

Exit status 1 npm ERR! npm ERR! Failed at the [email protected] dev script. npm ERR! This is probably not a problem with npm . There is likely additional logging output above. npm ERR! A complete log of this run can be. sudo npm install -g save- dev webpack-cli Running sudo webpack-cli also gave me this: assets by status 0.
By sympy pi  on 
More on Linux bash shell exit status codes. Every Linux or Unix command executed by the shell script or user, has an exit status.The exit status is an integer number. For the bash shell's purposes, a command which exits with a zero (0) exit status has succeeded. A non-zero (1-255) exit status indicates failure. In Linux any script run from the command line has an exit code.

wind up vintage alarm clock

live casino app

salesforce advanced approvals

Step 1: $ npm cache clean --force Step 2: Delete node_modules by $ rm -rf node_modules package-lock.json folder or delete it manually by going into the directory and right-click > delete.
Pros & Cons

genestealer base size

digitalocean review

Code: npm ERR! code ELIFECYCLE npm ERR! errno 1 npm ERR! [email protected] build: `react-scripts build` npm ERR! Exit status 1 npm ERR! npm ERR! Failed at the [email protected] build script. npm ERR! This is probably not a problem with npm. There is likely additional logging output above.
Pros & Cons

sig p320 threaded barrel and compensator

gauge cluster repair near me

Step 1: $ npm cache clean --force Step 2: Delete node_modules by $ rm -rf node_modules package-lock.json folder or delete it manually by going into the directory and right-click > delete.
Pros & Cons

ankylosis of fingers va rating

golden beach resort

npm ERR! Exit status 1 npm ERR! npm ERR! Failed at the [email protected]1 postinstall script. pp也耶: cmd node-v查看node.js版本. Python爬虫技术5天速成(2020全新合.
Pros & Cons

best airbnb in delhi for couples

oiler seaman salary per month

mbt build failure : npm ERR! `node-pre-gyp install --fallback-to-build` npm ERR! Exit status 1. 764 Views Last edit Jan 21, 2021 at 06:52 AM 2 rev. Follow RSS Feed npm ERR!.
Pros & Cons

mini castle gifting

yahoo fantasy draft analysis

解答问题 137 个.Exit status 1 npm ERR!npm ERR! Failed at the [email protected] postinstall script 'bower install && gulp build'. npm ERR! Make sure you have the latest version of node.js and.
Pros & Cons

doctor who characters az

table rock lake cabin rentals pet friendly

Oct 11, 2020 · 1. Step 1: $ npm cache clean --force. 2. 3. Step 2: Delete node_modules by $ rm -rf node_modules package-lock.json folder or delete it manually by going into the directory and right-click > delete / move to trash. Also, delete package-lock.json file too..
Pros & Cons

1982 toyota pickup diesel

3 bedroom house for sale in chingford

环境:MacOS High Sierra V10.13.6(13''2017)节点10.4. NPM 6.9.0 Docker 18.09.2 53.59GB 250GB Drive免费 发生了什么: I am following the setup instructions here. ... Docker will report an exit code in the logs, to inform you what happened to the container that caused it to shut down. Take Komodor for a Spin!..
Pros & Cons
calder casino app Tech wax london sale chuwi hi10 go price

Exit status 1 npm ERR! npm ERR! Failed at the [email protected] babel-node script. npm ERR! This is probably not a problem with npm. There is likely additional logging output above. npm ERR!. Busca trabajos relacionados con Npm err code eintegrity checksum failed when using sha512 o contrata en el mercado de freelancing más grande del mundo con más de 21m de trabajos. Es gratis registrarse y presentar tus propuestas laborales. Prerequisites.. Exit status 1 npm ERR! npm ERR! Failed at the [email protected] install script 'node-gyp rebuild'. npm ERR! Make sure you have the latest version of node.js and npm installed. npm ERR! If you do, this is most likely a problem with the memoryjs package, npm ERR! not with npm itself. npm ERR!.

Exit status 1 npm ERR! npm ERR! Failed at the [email protected] dev script. npm ERR! This is probably not a problem with npm . There is likely additional logging output above. npm ERR! A complete log of this run can be. sudo npm install -g save- dev webpack-cli Running sudo webpack-cli also gave me this: assets by status 0.

Either: upgrade your version of npm npm install npm -g --ca="". tell your current version of npm to use known registrars npm config set ca="". If this does not fix the problem, then you may have an SSL-intercepting proxy.. npm ERR! code ELIFECYCLE npm ERR! errno 1. Step 1: $ npm cache clean --force Step 2: Delete node_modules by $ rm -rf node_modules package-lock.json folder or delete it manually by going into the directory and right-click > delete / move to trash. Also, delete package-lock.json file too. npm ERR! Exit status 1 npm ERR! npm ERR! Failed at the [email protected] postinstall script. pp也耶: cmd node-v查看node.js版本. Python爬虫技术5天速成(2020全新合集),跟该老师学习写的爬虫代码(1)用xlwt. pp也耶: 嗯?是啥错误啊. Python爬虫技术5天速成(2020全新合集),跟该老师学习写. Step 1: $ npm cache clean --force Step 2: Delete node_modules by $ rm -rf node_modules package-lock.json folder or delete it manually by going into the directory and right-click > delete / move to trash. Also, delete package-lock.json file too. Step 3: npm install To start again, $ npm start This worked for me. Hopes it works for you too.

used 604 crate motor for sale

Exit status 1 npm ERR! npm ERR! Failed at the @ dev script. npm ERR! This is probably not a problem with npm. There is likely additional logging output above. npm ERR! A complete log of this run can be found in: npm ERR! C:\npm-cache\_logs\2020-12-02T16_52_11_795Z-debug.log. Exit status 1 npm ERR!npm ERR!Failed at the [email protected] build script 'ionic-app-scripts build'. npm ERR!Make sure you have the latest version of node.js and npm installed.npm ERR!If you do, this is most likely a problem with the DiGidot-Application package, npm ERR! not with npm itself.npm ERR!Tell the author that this fails on. npm ERR! errno 1 npm ERR! [email protected] postinstall: npm run bootstrap --no-ci && npm run build npm ERR! Exit status 1 npm ERR! npm ERR! Failed at the [email protected] postinstall script. npm ERR! This is probably not a problem with npm. There is likely additional logging output above. npm ERR! A complete log of this run can be found in: npm ERR!. Oct 24, 2016 · Once the test starts & is exited with an exit status of 1 (Build fails), the test section passes as if there weren’t any errors and it thinks my test exited with an exit status of 0. Excuse the verbose log, but if you scroll down you will see an exit code of 1 NPM log Yet circle CI says the test exited with an error code of 0. npm ERR! code ELIFECYCLE npm ERR! errno 1 npm ERR! [email protected]1.0 serve: vue-cli-service serve npm ERR! Exit status 1 npm ERR! npm ERR! Failed at the hello.

1971 ford f150 for sale near Melbourne VIC never enough piano sheet music musescore

Exit status 1 npm ERR! npm ERR! Failed at the [email protected] install script 'node-gyp rebuild'. npm ERR! Make sure you have the latest version of node.js and npm installed. npm ERR! If you do, this is most likely a problem with the node-sqlite3 package,.

  • npm ERR! code 1 npm ERR! path C:\Users\user\programming projects\mflix-js\node_modules\weak-napi npm ERR! command failed npm ERR! command C:\Windows\system32\cmd.exe /d /s /c node-gyp rebuild npm ERR! Building the projects in this solution one at a time. To enable parallel build, please add the "/m" switch. npm ERR! nothing.c. Exit status 1 npm ERR! npm ERR! Failed at the [email protected] dev script. npm ERR! This is probably not a problem with npm. There is likely additional logging output above. npm ERR! A complete log of this run can be found in: npm ERR! chanaka wickramasinghe. 71 2. Add a comment. 2. Exit status 1 npm ERR! npm ERR! Failed at the [email protected] postinstall script. npm ERR! This is probably not a problem with npm. There is likely additional logging output above. 1. 2. 3. 4. 5. 6. 7. 解决二 进入项目目录,运行命令: npm install --save-dev node-sass npm audit fix --force 或 npm rebuild node-sass (未测试) 1. 2. 3. 4. 5. 问题三. npm ERR! code ELIFECYCLE npm ERR! errno 1 npm ERR! [email protected]1.0.0 dev: `webpack-dev-server --inline --progress --config build/webpack.dev.conf.js` npm ERR! Exit status 1 npm ERR! npm ERR! Failed at the [email protected]1.0.0 dev script. npm ERR! This is probably not a problem with npm. There is likely additional logging output above. npm ERR!.

  • Exit status 1 npm ERR! npm ERR! Failed at the [email protected]1.0 build script. npm ERR! This is probably not a problem with npm. There is likely additional logging output above. my package.json looks like this: Code:. Exit status 1 npm ERR! npm ERR! Failed at the [email protected] postinstall script 'bower install && gulp build'. npm ERR! Make sure you have the latest version of node.js and npm installed. npm ERR! If you do, this is most likely a problem with the foundationsix package, npm ERR! not with npm itself. bethany funeral home obituaries. Exit status 1 npm ERR! npm ERR! Failed at the [email protected] postinstall script. npm ERR! This is probably not a problem with npm. There is likely additional logging output above. npm ERR! A complete log of this run can be found in: npm ERR! C:\Users\xiaooming\AppData\Roaming\npm-cache\_logs\2018-03-18T13_02_03_946Z-debug.log.

Exit status 1 npm ERR! npm ERR! Failed at the [email protected] babel-node script. npm ERR! This is probably not a problem with npm. There is likely additional logging output above. npm ERR!. 环境:MacOS High Sierra V10.13.6(13''2017)节点10.4. NPM 6.9.0 Docker 18.09.2 53.59GB 250GB Drive免费 发生了什么: I am following the setup instructions here. ... Docker will report an exit code in the logs, to inform you what happened to the container that caused it to shut down. Take Komodor for a Spin!..

natural gas share price chart

Exit status 1 npm ERR! npm ERR! Failed at the [email protected] postinstall script 'bower install && gulp build'. npm ERR! Make sure you have the latest version of node.js and npm installed. npm ERR! If you do, this is most likely a problem with the foundationsix package, npm ERR! not with npm itself. bethany funeral home obituaries.

  • asus ai tweaker download

  • glass blowing classes pasadena ca

  • rubber soles for crochet baby shoes

  • is pinched nerve surgery dangerous

  • realme c21y gallery apk

  • twilight render sketchup

  • flightbeam facebook

  • small bowel perforation pathology outlines

  • Jun 24, 2022 · The npm ERR! code 1 error usually occurs when you run the npm install command. This cause of this error is that one of the dependencies you define in your package.json file fails to be installed properly on your computer..

  • river bottom ranch wedding cost

  • wolves ukulele chords

  • devttyocto4a

  • year 7 curriculum

  • paint cup for hvlp spray gun

NPM will automatically refer to the the binary in node_modules for you, and execute the file or command. With the API. While it's recommended to run webpack-dev-server via the CLI, you may also choose to start a server via the API. See the related API documentation for webpack-dev-server. With TypeScript.

france vat refund 2022

Use el comando npm init para crear un archivo package.json para su aplicación. Este comando le solicita varias cosas, incluido el nombre y la versión de su aplicación y el nombre del archivo de punto de entrada inicial (de forma predeterminada, esto es index.js). Por ahora, solo acepte los valores predeterminados: npm init. Exit status 1 npm ERR! npm ERR! Failed at the [email protected] build script. npm ERR! This is probably not a problem with npm. There is likely additional logging output above. npm ERR!. npm ERR! code ENOLOCK npm ERR! audit This command requires an existing lockfile. code elifecycle npm err! errno 1 npm err! [email protected] install: `node cli.js install` npm err! exit status 1 npm err! npm err! failed at the [email protected] install script. verbose stack exit status 134; npm err! code elifecycle npm err! errno 1 npm err! [email protected] dev: `webpack serve` npm err! exit status 1; code elifecycle errno 1 node.

12 inch cast iron cauldron

Exit status 137 npm ERR! npm ERR! Failed at the [email protected] build script. npm ERR! This is probably not a problem with npm.. Chercher les emplois correspondant à The prelaunchtask ninja build active file terminated with exit code 1 ou embaucher sur le plus grand marché de freelance au monde avec plus de 21 millions d'emplois. L .... Dec 09, 2020 · Exit status 137 npm ERR! npm ERR! Failed at the [email protected] build script. npm ERR! This is probably not a problem with npm. There is likely additional logging output above. npm ERR! A complete log of this run can be found in: npm ERR! /root/.npm/_logs/2020-11-25T011_26_21_40Z-debug.log. disable bitlocker task sequence step. jolida 202a manual. npm ERR!code ELIFECYCLE npm ERR!errno 2. Step 1: $ npm cache clean --force Step 2: Delete node_modules by $ rm -rf node_modules package-lock.json folder or delete it manually by going into the directory and right-click > delete / move to trash. Also, delete package-lock.json file too. npm ERR!network.

screenshots of the merida and maca squarespace templates side by side
new fridge keeps tripping breaker david allan coe health

Mahfuj Ahsan Asks: npm ERR! Exit status 1 heroku logs --tail NodeJS After heroku logs --tails run on CLI showing this error, my local server working as without any error, i just console every API,. Exit status 1 npm ERR! npm ERR! Failed at the [email protected] postinstall script. npm ERR! This is probably not a problem with npm. There is likely additional logging output above. npm ERR! A complete log of this run can be found in: npm ERR! C:\Users\xiaooming\AppData\Roaming\npm-cache\_logs\2018-03-18T13_02_03_946Z-debug.log. 解决方案: ①、查看库包的版本信息,确认是否可以检测到 npm view @syk/demo versions --registry=私有库包地址 ②、带上库包地址进行安装 npm install @syk/demo --registry=私有库包地址 -S 2、问题2:Failed at the @syk/demo postinstall script. npm ERR! code ELIFECYCLE npm ERR! errno 1 npm ERR! @syk/demo postinstall: `npm run hide-ui-module` npm ERR! Exit status 1 npm ERR! npm ERR!. Ok, you could use replit build in data base, but I recommend firebase. On YouTube look up (firebase tutorial fireship ) and you’ll find help. Exit status 1 npm ERR! npm ERR! Failed at the [email protected] babel-node script. npm ERR! This is probably not a problem with npm. There is likely additional logging output above. npm ERR!.

ddr5 motherboard am4

Problem solving: 01. Check that the EXE execution does not exist in the configured path. 02. Whether the script is added/ bin/bash. Note: the environment variable in the screenshot does not allow $ {}, it must be replaced with the entity or written to the environment file. Oct 13 20:15:08 c_3.50 systemd[1]: Started etcd.

  • childfree reddit entitled parents

  • Exit status 1 npm ERR! npm ERR! Failed at the [email protected] build script. npm ERR! This is probably not a problem with npm. There is likely additional logging output above. my package.json looks like this:.

  • NPM will automatically refer to the the binary in node_modules for you, and execute the file or command. With the API. While it's recommended to run webpack-dev-server via the CLI, you may also choose to start a server via the API. See the related API documentation for webpack-dev-server. With TypeScript.

  • ielts question paper pattern

  • google pixel 6 pro review

  • 解决方案: ①、查看库包的版本信息,确认是否可以检测到 npm view @syk/demo versions --registry=私有库包地址 ②、带上库包地址进行安装 npm install @syk/demo --registry=私有库包地址 -S 2、问题2:Failed at the @syk/demo postinstall script. npm ERR! code ELIFECYCLE npm ERR! errno 1 npm ERR! @syk/demo postinstall: `npm run hide-ui-module` npm ERR! Exit status 1 npm ERR! npm ERR!.

  • Jul 31, 2015 · Exit status -1 npm ERR! npm ERR! Failed at the [email protected] prestart script 'npm install'. npm ERR! This is most likely a problem with the angular-seed package, npm ERR! not with npm itself. npm ERR! Tell the author that this fails on your system: npm ERR! npm install npm ERR! You can get their info via: npm ERR! npm owner ls angular-seed npm ERR!.

Exit status 1 npm ERR ! npm ERR ! Failed at the [email protected]1.. install script 'node-gyp configure build'. npm ERR ! This is most likely a problem with the node-proxy package, npm ERR ! not with npm itself. npm ERR ! Tell the author that this fails on your system: npm ERR !.. Exit status 1 npm ERR ! npm ERR ! Failed at the [email protected]1.. install script 'node-gyp configure build'. npm ERR ! This is most likely a problem with the node-proxy package, npm ERR ! not with npm itself. npm ERR ! Tell the author that this fails on your system: npm ERR !..

npm ERR! errno 1 npm ERR! [email protected] test: `wdio ./wdio.conf.js` npm ERR! Exit status 1 npm ERR! npm ERR! Failed at the [email protected] test script. npm ERR! This is probably not a problem with npm. There is likely additional logging output above. npm ERR! A complete log of this run can be found in: npm ERR!.

best goose down comforter
n54 oil cooler leak
how to organize a facebook page
  • Squarespace version: 7.1
english bible online niv

Use el comando npm init para crear un archivo package.json para su aplicación. Este comando le solicita varias cosas, incluido el nombre y la versión de su aplicación y el nombre del archivo de punto de entrada inicial (de forma predeterminada, esto es index.js). Por ahora, solo acepte los valores predeterminados: npm init.

what is the statute of limitations on asbestos claims

mercury 60 hp 4 stroke fuel line
slutload pussy to mouth
abhimaan full movie
  • Squarespace version: 7.1
bbc degree apprenticeships 2022

Exit status 1 npm ERR! npm ERR! Failed at the [email protected] dev script. npm ERR! This is probably not a problem with npm. There is likely additional log ging output above. npm WARN Local package.json exists, but node_modules missing, did you mean to in stall? npm ERR! A complete log of this run can be found in:. 环境:MacOS High Sierra V10.13.6(13''2017)节点10.4. NPM 6.9.0 Docker 18.09.2 53.59GB 250GB Drive免费 发生了什么: I am following the setup instructions here. ... Docker will report an exit code in the logs, to inform you what happened to the container that caused it to shut down. Take Komodor for a Spin!.. Exit status 1 npm ERR! npm ERR! Failed at the [email protected] ios script. npm ERR! This is probably not a problem with npm. There is likely additional logging output above. npm ERR! A complete log of this run can be found in: npm ERR! /Users/jamie/.npm/_logs/2021-08-17T10_48_38_832Z-debug.log. Exit status 137 npm ERR! npm ERR! Failed at the [email protected] build script. npm ERR! This is probably not a problem with npm.. Chercher les emplois correspondant à The prelaunchtask ninja build active file terminated with exit code 1 ou embaucher sur le plus grand marché de freelance au monde avec plus de 21 millions d'emplois. L ....

npm ERR! C:\Users\ThinkT420\AppData\Roaming\npm-cache\_logs\2017-10-30T06_50_38_610Z-debug.log. Before there are times this, thought it is really not enough permissions, feel a little strange, with administrator rights to perform, sometimes really useful, but later checked, when the cache problem, clean up the cache on the line, without.

yugioh gamble deck reddit
fun things to do with friends outside
myfwc hunting brochures
  • Squarespace version: 7.1
pickup body for sale

Stack Exchange network consists of 182 Q&A communities including Stack Overflow, the largest, most trusted online community for developers to learn, share their knowledge, and build their careers.. Visit Stack Exchange. You only have this get route: app.get ('/todo', function (req, res). So only when you go to /todo your express server will actually do something. If you want to always render the todo view you can use: app.get ('*', function (req, res) Or if you only want / and /todo to render the todo view, you can add this route:. 环境:MacOS High Sierra V10.13.6(13''2017)节点10.4. NPM 6.9.0 Docker 18.09.2 53.59GB 250GB Drive免费 发生了什么: I am following the setup instructions here. ... Docker will report an exit code in the logs, to inform you what happened to the container that caused it to shut down. Take Komodor for a Spin!..

eks restart node group

marine traffic la spezia
grey knights 9th edition stratagems
math baseball pro
  • Squarespace version: 7.0
best room and board fabric

[email protected] install: `(node install/libvips && node install/dll-copy && prebuild-install) || (node-gyp rebuild && node install/dll-copy)` npm ERR! Exit status 1 npm ERR! npm ERR! Failed at the [email protected] install script. npm ERR! This is probably not a problem with npm. There is likely additional logging output above. npm ERR!. You run the build and execute scripts with commands like: $ npm run build and $ npm run startI want to write logic in shell script which will retry it to run again after 15 sec upto 5 times based on " status code=FAIL" if it fails due to some issue. node run comand. Jul 04, 2021 · Docker yarn build failed with exit code 1. warning package. Exit status 1 npm ERR! npm ERR! Failed at the [email protected] install script. npm ERR! This is probably not a problem with npm. There is likely additional logging output above. Output of dir node_modules ( i did npm install web3 in an empty folder). npm ERR! code ELIFECYCLE npm ERR! errno 1 npm ERR! [email protected] start: node server.js npm ERR! Exit status 1 npm ERR! npm ERR! Failed at the [email protected] start script. npm ERR! This is probably not a problem with npm. There is likely additional log ging output above. npm ERR! A complete log of this run can be found in: npm ERR!. p219a code ford focus; hyundai eon steering box. pipe hole cover plate. prefix and suffix worksheets with answers. 2 bedroom house to rent in milton keynes rogue lineage roblox link;.

accuracy vs f1

stairs for deer blinds
greek word for soulmate
who owns flying monkeys brewery
  • Squarespace version: 7.1
personalised water bottles 750ml

npm ERR! Exit status 1 npm ERR! npm ERR! Failed at the [email protected]1 postinstall script. pp也耶: cmd node-v查看node.js版本. Python爬虫技术5天速成(2020全新合集),跟该老师学习写的爬虫代码(1)用xlwt. pp也耶: 嗯?是啥错误啊. Python爬虫技术5天速成(2020全新合集),跟该老师学习写. Npm err code ehostunreach Jul 25, 2018 · 一般来说, npm 安装失败时需要注意下面几点: 是否能够访问安装源:检查代理和当前安装源.

pla retraction settings direct drive

my month of good news
adrenal fatigue nhs
change hairstyle nba 2k22
  • Squarespace version: 7.1
zoneminder vs blue iris 2022

sudo apt install libxslt-dev libffi-dev libssl-dev. CentOS, RHEL, Fedora: sudo dnf install libxslt-devel libffi-devel openssl-devel. Exit status 126 npm ERR! npm ERR! Failed at the @ dev script. npm ERR! This is probably not a problem with npm. There is likely additional logging output above. npm ERR! A complete log of this run can be found in : npm ERR! /home/laradock/.npm/_logs/ 2019 - 10 -29T01_34_23_741Z-debug.log 対応 node_modulesを一旦削除し、再度インストールすることで対応できました。 1.

pk trophy strain review

120408 f20
lucas oil late model apparel
symptoms of omicron covid
  • Squarespace version: 7.1
hp probookelitebook bios unlock v2 518 software download

If you see an EACCES error when you try to install a package globally, you can either: Reinstall npm with a node version manager (recommended), or Manually change npm's default directory Reinstall npm with a node version manager This is the best way to avoid permissions issues. Gyp compiles native code to a nodejs module. In order to do that it basically has two important steps: Configuring & building. What has to be done in those steps is described in the binding.gyp and differs from project to project. For example in node canvas "npm install" first runs "node-gyp configure" which builds a one (or more) makefile. npm ERR! errno 1 npm ERR! [email protected] postinstall: npm run bootstrap --no-ci && npm run build npm ERR! Exit status 1 npm ERR! npm ERR! Failed at the [email protected] postinstall script. npm ERR! This is probably not a problem with npm. There is likely additional logging output above. npm ERR! A complete log of this run can be found in: npm ERR!. Oct 15, 2017 · Exit status 1 npm ERR! npm ERR! Failed at the [email protected] start script 'node index.js'. npm ERR! Make sure you have the latest version of node.js and npm installed. npm ERR! If you do, this is most likely a problem with the telegram-bot package, npm ERR! not with npm itself. npm ERR! Tell the author that this fails on your system: npm ERR! node index.js npm ERR!.

wrath movie 2022 cast

treehouse ventures
global lithium market
best glock rmr co witness sights
  • Squarespace version: 7.1
cognizant exam answers telegram channel

Exit status 1 npm ERR! npm ERR! Failed at the [email protected]1.0.0 dev script. npm ERR! This is probably not a problem with npm. There is likely additional logging output above. npm ERR! A complete log of this run can be found in: npm ERR! C:\Users\asus\AppData\Roaming\npm-cache\_logs\2019-06-15T16_43_01_654Z-debug.log 这. Exit status 1 npm ERR! npm ERR! Failed at the [email protected] start script. npm ERR! This is probably not a problem with npm. There is likely additional logging output above. npm ERR! A complete log of this run can be found in: npm ERR! /Users/nsebhastian/.npm/_logs/2022-05-09T03_20_51_340Z-debug.log. npm ERR! code ELIFECYCLE npm ERR! errno 1 npm ERR! [email protected] start: ts-node -r tsconfig-paths/register app.ts --files npm ERR! Exit status 1 npm ERR! npm ERR! Failed at the [email protected] start script. npm ERR! This is probably not a problem with npm. There is likely additional logging output above. npm ERR! A complete log of. Exit status 1: npm ERR! npm ERR! Failed at the [email protected] install script. npm ERR! This is most likely a problem with the heapdump package, npm ERR! not with npm itself. npm ERR! Tell the author that this fails on your system: npm ERR!.

环境:MacOS High Sierra V10.13.6(13''2017)节点10.4. NPM 6.9.0 Docker 18.09.2 53.59GB 250GB Drive免费 发生了什么: I am following the setup instructions here. ... Docker will report an exit code in the logs, to inform you what happened to the container that caused it to shut down. Take Komodor for a Spin!..

closed audition example


how to download videos on vlc mobile


please let me know your availability at your convenience
non prescription anti inflammatory for dogs

pond price prediction tomorrow
craigslist nashville sporting goods by owner

white ankle boots new look
fast card application

how to rotate photos

resident evil 3 nemesis edition reddit

samsung u28e590d firmware update

jollibee tagline history

1995 chevy k5 blazer for sale

minecraft beautiful seed

how to make a bluetooth circuit board

santa fe nm real estate

forbes top wealth advisors 2022

worcester county registry of deeds
electrical maintenance tools list


ict index higher or lower better

salary of director at barclays

stock scalping algorithm

ultrasound contraindications

marcus bank login

shipping barrel for sale


lilly avenue highfields
kyocera kx driver windows 10
Code: npm ERR! code ELIFECYCLE npm ERR! errno 1 npm ERR! [email protected] build: `react-scripts build` npm ERR! Exit status 1 npm ERR! npm ERR! Failed at the [email protected] build script. npm ERR! This is probably not a problem with npm. There is likely additional logging output above.